CFLOWD make error on FreeBSD 4.2

From: Scott Muller (smuller@netcommplete.com.au)
Date: Tue Apr 03 2001 - 16:36:56 PDT

  • Next message: Didier CONTIS: "Cflowd and Cisco Catalyst 6500 + PFC2 + MSFC2"

    -----BEGIN PGP SIGNED MESSAGE-----
    Hash: SHA1

    Hi,

    Sorry for the long winded explanation, but I want to supply as much
    info as possible.

    I am having troubles compiling cflowd on Free BSD 4.2. I have
    searched the mailing list archive, but I couldn't find any problems
    the same as this. I did try some of the fixes relating to download &
    installing additional GNU utilities and removing the entire cflowd
    directory, but I have had no success.

    I have downloaded the latest version of clowd (cflowd-2-1-b1). I have
    untarred in numerous times, but I am getting the errors below. I have
    included details of the versions of software etc that I have
    installed. I tried using 'make' & 'gmake'. I guess that I need to
    make changes to some sort of path variable, but I'm a little lost !!

    I have done a 'find' on the two missing files and have located them
    at the following locations :
    /usr/local/include/ArtsPrimitive.hh
    /usr/local/include/caida_t.h

    I'm sure that there is a very simple fix to this, but I am not a Code
    cutter, so I am struggling badly !!
    any help would be most appreciated.

    Many Thanks,

    Scott Muller.

    ======= Software Versions
    gcc version 2.95.2 19991024 (release)
    FreeBSD Version 4.2

    ======= Installed Pakages

    arts++-1-1-a8_1 A network data storage and analysis library from
    CAIDA
    autoconf-2.13 Automatically configure source code on many Un*x
    platforms
    bison-1.28 A parser generator from FSF, (mostly) compatible
    with Yacc
    gettext-0.10.35 GNU gettext package
    gmake-3.79.1 GNU version of 'make' utility
    gtar-1.13.19 GNU version of the traditional tar archiver
    m4-1.4 GNU's m4
    patch-2.5_1 GNU patch utility

    ======= Using 'gmake'

    gmake[1]: Leaving directory `/usr/downloads/cflowd-2-1-b1/snmp++'
    cd classes; gmake
    gmake[1]: Entering directory `/usr/downloads/cflowd-2-1-b1/classes'
    cd src; gmake
    gmake[2]: Entering directory
    `/usr/downloads/cflowd-2-1-b1/classes/src'
    c++ -g -O2 -I../include -I../../include -I/usr/local/arts/include -c
    CflowdAsMatrix.cc -o C
    flowdAsMatrix.o
    CflowdAsMatrix.cc:45: ArtsPrimitive.hh: No such file or directory
    In file included from CflowdAsMatrix.cc:46:
    ../include/CflowdAsMatrix.hh:48: caida_t.h: No such file or directory
    In file included from ../include/CflowdAsMatrixKey.hh:45,
                     from ../include/CflowdAsMatrix.hh:54,
                     from CflowdAsMatrix.cc:46:
    ../include/CflowdUint16Uint16Key.hh:51: caida_t.h: No such file or
    directory
    ../include/CflowdUint16Uint16Key.hh:56: ArtsPrimitive.hh: No such
    file or directory
    In file included from ../include/CflowdAsMatrixTrafficCounter.hh:45,
                     from ../include/CflowdAsMatrix.hh:55,
                     from CflowdAsMatrix.cc:46:
    ../include/CflowdUint64TrafficCounter.hh:49: caida_t.h: No such file
    or directory
    ../include/CflowdUint64TrafficCounter.hh:52: ArtsPrimitive.hh: No
    such file or directory
    In file included from ../include/CflowdAsMatrix.hh:56,
                     from CflowdAsMatrix.cc:46:
    ../include/CflowdRawFlow.hh:57: caida_t.h: No such file or directory
    gmake[2]: *** [CflowdAsMatrix.lo] Error 1
    gmake[2]: Leaving directory
    `/usr/downloads/cflowd-2-1-b1/classes/src'
    gmake[1]: *** [all] Error 2
    gmake[1]: Leaving directory `/usr/downloads/cflowd-2-1-b1/classes'
    gmake: *** [all] Error 2

    ======= Using 'make'

    (cd ../lib/.libs && rm -f libsnmp++.la && ln -s ../libsnmp++.la
    libsnmp++.la)
    cd classes; make
    cd src; make
    c++ -g -O2 -I../include -I../../include -I/usr/local/arts/include -c
    CflowdAsMatrix.cc -o C
    flowdAsMatrix.o
    CflowdAsMatrix.cc:45: ArtsPrimitive.hh: No such file or directory
    In file included from CflowdAsMatrix.cc:46:
    ../include/CflowdAsMatrix.hh:48: caida_t.h: No such file or directory
    In file included from ../include/CflowdAsMatrixKey.hh:45,
                     from ../include/CflowdAsMatrix.hh:54,
                     from CflowdAsMatrix.cc:46:
    ../include/CflowdUint16Uint16Key.hh:51: caida_t.h: No such file or
    directory
    ../include/CflowdUint16Uint16Key.hh:56: ArtsPrimitive.hh: No such
    file or directory
    In file included from ../include/CflowdAsMatrixTrafficCounter.hh:45,
                     from ../include/CflowdAsMatrix.hh:55,
                     from CflowdAsMatrix.cc:46:
    ../include/CflowdUint64TrafficCounter.hh:49: caida_t.h: No such file
    or directory
    ../include/CflowdUint64TrafficCounter.hh:52: ArtsPrimitive.hh: No
    such file or directory
    In file included from ../include/CflowdAsMatrix.hh:56,
                     from CflowdAsMatrix.cc:46:
    ../include/CflowdRawFlow.hh:57: caida_t.h: No such file or directory
    *** Error code 1

    Stop in /usr/downloads/cflowd-2-1-b1/classes/src.
    *** Error code 1

    Stop in /usr/downloads/cflowd-2-1-b1/classes.
    *** Error code 1

    Stop in /usr/downloads/cflowd-2-1-b1.

    -----BEGIN PGP SIGNATURE-----
    Version: PGPfreeware 6.5.8 for non-commercial use <http://www.pgp.com>

    iQA/AwUBOsnR+UC+bDPx1b6SEQIvSQCgmN5Edvb4NRVjtqk3Od33td8LXzUAn0vP
    w/VfiRKdp95otai9+6O2eVmp
    =v65N
    -----END PGP SIGNATURE-----

    --
    cflowd mailing list
    cflowd@caida.org
    



    This archive was generated by hypermail 2b29 : Tue Apr 03 2001 - 16:48:35 PDT