Compiler errors for cflowd on Solaris 2.6

From: Diane Proscino-Tharp (Diane.Proscino-Tharp@oracle.com)
Date: Thu Jun 21 2001 - 15:40:48 PDT

  • Next message: Liger-dc: "RE: No Flows collected"

    I have made several attempts to compile and install cflowd-2-1-b1 and
    have been completely unsuccessful.

    My system/environment specifics are:

    Solaris 2.6
    GCC 2.95.1
    Make 3.79
    arts++-1-1-a5

    I get the following error message:

    make[2]: Entering directory
    `/u01/netflow-src/cflowd-2-1-b1/apps/cflowdmux'
    c++ -g -O2 -c CflowdRawFlowClientList.cc -I../../classes/include
    -I../../include -I.
    -I/usr/local/arts/include
    c++ -g -O2 -c cflowdmux.cc -I/usr/local/arts/include
    -I../../classes/include -I../../include -I.
    -I../../snmp++/classes/include
    mkdir .libs
    c++ -g -O2 CflowdRawFlowClientList.o cflowdmux.o
    ../../classes/lib/.libs/libCfd.a -L/usr/local/arts/lib
    -lArts ../../snmp++/classes/lib/.libs/libsnmp++.a -lfl -lsocket -lnsl -o
    cflowdmux -Wl,--rpath
    -Wl,/usr/local/arts/lib -Wl,--rpath -Wl,/usr/local/arts/lib
    /usr/local/lib/gcc-lib/sparc-sun-solaris2.6/2.95.1/libgcc.a: could not
    read symbols: Bad value
    collect2: ld returned 1 exit status
    make[2]: *** [cflowdmux] Error 1
    make[2]: Leaving directory
    `/u01/netflow-src/cflowd-2-1-b1/apps/cflowdmux'
    make[1]: *** [cflowdmux] Error 2
    make[1]: Leaving directory `/u01/netflow-src/cflowd-2-1-b1/apps'
    make: *** [all] Error 2

    Any help wll be greatly appreciated as I need to get this installed
    quickly for a project which requires FlowScan.

    Thanks,
       ---Diane

    -- 
    *****************************
    Diane Proscino-Tharp
    Voice:  408-506-3759
    Email:  dproscin@oracle.com
    *****************************
    
    

    --
    cflowd mailing list
    cflowd@caida.org
    



    This archive was generated by hypermail 2b29 : Thu Jun 21 2001 - 15:49:13 PDT