[Cflowd] RE:[cflowd]make problem on linux

From: tahereh mehrjerdi (tmehrjerdi2002@yahoo.com)
Date: Sat Mar 08 2003 - 02:30:24 PST

  • Next message: wangxuejun@tj.cnuninet.net: "[Cflowd] parse error when compiling on Solaris 7"

        hi

    Having problem when trying to do a "make"

    system: redhat 8

    I,m a newbie with linux ,

    I install arts++-1-1-a8 and bison -1.875 and flex -2.5.4 and cflowd -2-1-b1

    Please help to me for detect problem step one step .

    thankyou

    Here's the output from the make

    cd snmp++; make
    make[1]: Entering directory `/home/gzulauf/downloads/cflowd-2-1-b1/snmp++'
    cd classes; make
    make[2]: Entering directory
    `/home/gzulauf/downloads/cflowd-2-1-b1/snmp++/classes'
    cd src; make
    make[3]: Entering directory
    `/home/gzulauf/downloads/cflowd-2-1-b1/snmp++/classes/src'
    g++ -D__unix__ -I../include/snmp++ -I./ -g -O2 -c oid.cpp -o oid.o
    In file included from /usr/include/c++/3.2/backward/iostream.h:31,
                     from ../include/snmp++/smival.h:49,
                     from ../include/snmp++/oid.h:62,
                     from oid.cpp:59:
    /usr/include/c++/3.2/backward/backward_warning.h:32:2: warning: #warning This
    file includes at
    least one deprecated or antiquated header. Please consider using one of the 32
    headers found in
    section 17.4.1.2 of the C++ standard. Examples include substituting the <X>
    header for the <X.h>
    header for C++ includes, or <sstream> instead of the deprecated header
    <strstream.h>. To disable
    this warning use -Wno-deprecated.
    In file included from oid.cpp:59:
    ../include/snmp++/oid.h:181: `vector' was not declared in this scope
    ../include/snmp++/oid.h:181: parse error before `>' token
    oid.cpp:503: `vector' was not declared in this scope
    oid.cpp:503: parse error before `>' token
    oid.cpp: In member function `void Oid::get_oid(...) const':
    oid.cpp:505: `outVect' undeclared (first use this function)
    oid.cpp:505: (Each undeclared identifier is reported only once for each
       function it appears in.)
    make[3]: *** [oid.lo] Error 1
    make[3]: Leaving directory
    `/home/gzulauf/downloads/cflowd-2-1-b1/snmp++/classes/src'
    make[2]: *** [all] Error 2
    make[2]: Leaving directory
    `/home/gzulauf/downloads/cflowd-2-1-b1/snmp++/classes'
    make[1]: *** [classes/lib/libsnmp++.a] Error 2
    make[1]: Leaving directory `/home/gzulauf/downloads/cflowd-2-1-b1/snmp++'
    make: *** [all] Error 2

     

     

     

    ---------------------------------
    Do you Yahoo!?
    Yahoo! Tax Center - forms, calculators, tips, and more

    _______________________________________________
    Cflowd mailing list
    Cflowd@caida.org
    http://login.caida.org/mailman/listinfo/cflowd



    This archive was generated by hypermail 2.1.4 : Sat Mar 08 2003 - 02:41:44 PST