[Cflowd] problem building cflowd

From: fingers (fingers@fingers.co.za)
Date: Wed Mar 12 2003 - 01:02:41 PST

  • Next message: Pascal LARHANT: "Re: [Cflowd] install problem"

    hi there

    i'm having hassles building cflowd (with flowscan patch) under
    FreeBSD 5.0-RELEASE-p4.

    /usr/include/g++/backward/backward_warning.h:32:2: warning: #warning This
    file includes at least one deprecated or antiquated header. Please
    consider using one of the 32 headers found in section of the C++
    standard. Examples include substituting the <X> header for the <X.h>
    header for C++ includes, or <sstream> instead of the deprecated header
    <strstream.h>. To disable this warning use -Wno-deprecated.
    In file included from oid.cpp:59:
    ../include/snmp++/oid.h:181: ector' was not declared in this scope
    ../include/snmp++/oid.h:181: syntax error before ' token
    oid.cpp:503: ector' was not declared in this scope
    oid.cpp:503: syntax error before ' token
    oid.cpp: In member function oid Oid::get_oid(...) const':
    oid.cpp:505: utVect' undeclared (first use this function)
    oid.cpp:505: (Each undeclared identifier is reported only once for each
       function it appears in.)
    gmake[3]: *** [oid.lo] Error 1
    gmake[3]: Leaving directory
    gmake[2]: *** [all] Error 2
    gmake[2]: Leaving directory
    gmake[1]: *** [classes/lib/libsnmp++.a] Error 2
    gmake[1]: Leaving directory
    gmake: *** [all] Error 2
    *** Error code 2

    Stop in /usr/ports/net/cflowd.

    I've scanned my archives and found one or 2 similar problems, but not
    quite the same broken make. any suggestions would be appreciated.



    Cflowd mailing list

    This archive was generated by hypermail 2.1.4 : Wed Mar 12 2003 - 01:08:47 PST